count,mutation,chain,sst,rsa,phi,psi,residue_depth,relative_bfactor,hydrophobics,positives,negatives,acceptors,donnors,aromatics,sulfurs,neutral,HENS920102,HENS920103,WEIL970102,HENS920101,GRAR740104,PRLA000102,HENS920104,WEIL970101,GIAG010101,RISJ880101,DOSZ010102,DOSZ010103,JOND940101,DOSZ010101,ZHAC000101,MIYS990106,ZHAC000103,LIWA970101,QU_C930103,QU_C930102,QU_C930101,ZHAC000106,ZHAC000104,MIYS850102,MIYS850103,MIYS990107,GODA950101,BRYS930101,RIER950101,KOSJ950110_RSA,JOND920103,VOGG950101,KESO980102,OGAK980101,NIEK910102,AZAE970101,AZAE970102,NIEK910101,TUDE900101,CROG050101,MIYS930101,MIYS960101,SIMK990105,SIMK990104,TOBD000102,BETM990101,TOBD000101,KOLA920101,MEHP950102,MEHP950101,PRLA000101,JOHM930101,QUIB020101,ROBB790102,MIRL960101,GEOD900101,KOSJ950100_SST,DAYM780302,DAYM780301,LUTR910106,LUTR910107,LUTR910104,LUTR910105,LUTR910102,LUTR910103,THOP960101,LUTR910101,GONG920101,MCLA710101,LUTR910108,LUTR910109,SKOJ970101,SKOJ000101,OVEJ920101,KANM000101,VENM980101,RUSR970103,RUSR970102,RUSR970101,LINK010101,MUET010101,KOLA930101,MCLA720101,ALTS910101,LEVJ860101,BONM030101,BONM030106,MOOG990101,BONM030105,ZHAC000105,KAPO950101,OVEJ920100_RSA,FEND850101,NGPC000101,SIMK990103,KESO980101,SKOJ000102,TANS760101,TANS760102,MIYT790101,BLAJ010101,PARB960101,CSEM940101,OVEJ920102,OVEJ920103,BONM030103,PARB960102,MICC010101,BONM030102,KOSJ950100_RSA_SST,DOSZ010104,MUET020101,MUET020102,ZHAC000102,SIMK990102,NAOD960101,SIMK990101,MEHP950103,MIYS960102,MIYS960103,BONM030104,KOSJ950115,BASU010101,BENS940104,BENS940102,BENS940103,BENS940101,FITW660101,MOHR870101,ddg_mcsm,ddg_ppi1,ddg_ppi2,distance_ppi,blosum100,blosum30,blosum35,blosum40,blosum45,blosum50,blosum55,blosum60,blosum62,blosum65,blosum70,blosum75,blosum80,blosum85,blosum90,blosum95,pam120,pam180,pam250,pam30,pam300,pam60,pam90,dds_encom,ddg_duet,ddg_encom,ddg_sdm,ddg_dynamut,mtr,B.1,B,A.5,B.2.1,A,B.7,B.5,B.1.1,B.1.8,B.3,B.2,B.4,A.1,A.3,B.1.38,B.1.22,A.2,B.1.5,B.6,B.1.23,B.2.2,B.1.13,B.1.1.1,B.1.36,B.1.1.4,B.1.1.9,B.1.6,B.1.1.7,B.2.5,B.1.41,B.9,B.2.6,B.10,B.1.39,B.1.34,B.1.43,B.1.3,B.1.26,B.1.33,B.1.31,B.1.1.10,B.1.29,B.16,A.4,B.1.5.3,B.1.69,A.6,B.1.5.1,B.1.1.17,B.2.7,B.2.4,A.1.3,B.1.1.8,B.1.12,B.1.5.6,B.1.30,B.15,B.1.1.5,B.1.1.6,A.1.1,B.1.67,B.1.44,B.1.1.2,B.1.37,B.1.71,B.1.5.4,B.1.40,B.1.35,B.1.70,B.14,B.1.5.2,B.1.19,B.1.66,B.1.32,B.1.72,B.1.1.13,B.1.1.3,B.1.1.14,B.1.5.5,B.13,B.1.1.18,total_clade,consurf,wt_fluctuation,mt_fluctuation,diff_fluctuation,Covalent_wt,VDWClash_wt,VDW_wt,Proximal_wt,Hbond_wt,WeakHbond_wt,Ionic_wt,Aromatic_wt,Hydrophobic_wt,Carbonyl_wt,Polar_wt,WeakPolar_wt,Pi_wt,Covalent_mt,VDWClash_mt,VDW_mt,Proximal_mt,Hbond_mt,WeakHbond_mt,Ionic_mt,Aromatic_mt,Hydrophobic_mt,Carbonyl_mt,Polar_mt,WeakPolar_mt,Pi_mt,wt_deformation,mt_deformation,diff_deformation,diff_cto_hbond,diff_cto_polar,diff_cto_ionic,diff_cto_aromatic,diff_cto_carbonyl,diff_cto_hydrophobic,diff_cto_pi,deformation_wt,deformation_mt,fluctuation_wt,fluctuation_mt
2,V31A,A,-,0.00704225352113,-38.7,32.3,3.92320215511,0.0,2.0,0.0,0.0,0.0,0.0,0.0,0.0,0.0,-1,-2,1,-1,89,-3.03,-1,0,-0.8,1.6,-7.48,3.2,0,13.6,-1.52,-0.15,-0.2,-3.87,1,0.382,0.385,-0.28,-2,-3.74,0.13,0.08,0.1,0.167,88,3.1,1,4.6,0.14,-7.1,0.32,-4,-2,0.3,-5,-2,-0.59,-4.03,0.00232,-0.02153,-0.18,0,-0.29,0,1.27,-,-0.96,-3.2,0,-0.808,0.14,8,1.4,-2,0,-7,-1,2,-3,-1,3,-0.29,0,-0.6,3,1,-7,-0.3,-0.2,-2,-8,0.0158,0,0,0,0.039,0.5,0,1,0,0,0.3,6.1,-0.05,5.8,-0.3,17.5,0.015,3,-1,0.00418,-3.61,-0.2,-5.9,67,2.14,-3,-0.6,0,0.026,0.027,-0.3,-3.8,-0.004179,0.4,0.1,-1.36,-1,0,-1.14,0.11428,-3,0.2867,0.79,0.13,7958,5.6,2,-0.07,0.8,0.3,-0.3,0.7,1,10,-0.5539999999999999,> 10 Å,,43.750328387299994,-1.0,1.0,0.0,0.0,0.0,0.0,0.0,0.0,0.0,0.0,0.0,0.0,0.0,-1.0,-1.0,-1.0,0.0,0.0,0.0,-2.0,0.0,-1.0,0.0,-,-,-,-,-,0.598070739549839,0.0,0.0,0.0,0.0,0.0,0.0,0.0,2.0,0.0,0.0,0.0,0.0,0.0,0.0,0.0,0.0,0.0,0.0,0.0,0.0,0.0,0.0,0.0,0.0,0.0,0.0,0.0,0.0,0.0,0.0,0.0,0.0,0.0,0.0,0.0,0.0,0.0,0.0,0.0,0.0,0.0,0.0,0.0,0.0,0.0,0.0,0.0,0.0,0.0,0.0,0.0,0.0,0.0,0.0,0.0,0.0,0.0,0.0,0.0,0.0,0.0,0.0,0.0,0.0,0.0,0.0,0.0,0.0,0.0,0.0,0.0,0.0,0.0,0.0,0.0,0.0,0.0,0.0,0.0,0.0,0.0,2.0,-0.389,0.0733830488463146,0.0761453171676075,-,0.0,2.0,1.0,32.0,1.0,3.0,0.0,0.0,1.0,0.0,1.0,1.0,3.0,0.0,2.0,1.0,28.0,1.0,2.0,0.0,0.0,0.0,0.0,1.0,2.0,3.0,4.8157140419408,4.6146321412146785,-,,,,,,,,-,-,-,-
2,V31I,A,-,0.007042253521127,-38.7,32.3,3.9232021551144505,0.0,-1.0,0.0,0.0,0.0,0.0,0.0,0.0,0.0,4,4,-1,3,29,5.23,4,2,2.1,2.2,9.49,11.9,2,35.9,-2.66,-0.67,-1.25,-5.01,6,0.946,0.641,-0.9,-3.5,-5.58,-0.26,-0.16,-0.1,-0.253,97,11.1,4,8.3,-0.33,-5.7,0.72,9,11,0.67,46,3,0.41,-6.05,-0.02164,-0.04232,-1.46,-0.68,-0.98,9,1.42,0.83,1.94,3.9,4.5,-1.248,-0.25,10,6.3,2,4,11,24,5,11,17,18,-0.98,24,3.1,5,13,11,-1.2,-1,2,35,-0.1095,5,7,4,0.146,4.5,-0.7,2,3,1,-0.5,6.1,0.2,6,-1.64,22.2,0.205,5,3,-0.13605,-5.31,-1,-7.3,216,0.85,8,-1.2,0.7,0.178,0.202,-0.9,-5,0.002618,-0.2,6,7,4,3,-2.46,-0.27482,9,-0.1963,0.45,-0.29,19830,5.6,8.8,-0.4223,1,3.6,3.2,3.9,1,12,-0.332,> 10 Å,,43.750328387299994,2.0,4.0,4.0,4.0,3.0,4.0,4.0,3.0,3.0,3.0,3.0,3.0,3.0,3.0,3.0,3.0,3.0,5.0,4.0,2.0,4.0,3.0,3.0,-,-,-,-,-,0.598070739549839,2.0,0.0,0.0,0.0,0.0,0.0,0.0,0.0,0.0,0.0,0.0,0.0,0.0,0.0,0.0,0.0,0.0,0.0,0.0,0.0,0.0,0.0,0.0,0.0,0.0,0.0,0.0,0.0,0.0,0.0,0.0,0.0,0.0,0.0,0.0,0.0,0.0,0.0,0.0,0.0,0.0,0.0,0.0,0.0,0.0,0.0,0.0,0.0,0.0,0.0,0.0,0.0,0.0,0.0,0.0,0.0,0.0,0.0,0.0,0.0,0.0,0.0,0.0,0.0,0.0,0.0,0.0,0.0,0.0,0.0,0.0,0.0,0.0,0.0,0.0,0.0,0.0,0.0,0.0,0.0,0.0,2.0,-0.389,0.0783385272035681,0.0761453171676075,-,0.0,2.0,1.0,32.0,1.0,3.0,0.0,0.0,1.0,0.0,1.0,1.0,3.0,0.0,2.0,1.0,28.0,1.0,2.0,0.0,0.0,0.0,0.0,1.0,2.0,3.0,4.8157140419408,4.949644076909911,-,,,,,,,,-,-,-,-
39,Y38H,A,S,0.337837837838,47.0,35.1,1.9666576651400005,0.0,3.0,-2.0,0.0,0.0,-1.0,1.0,0.0,0.0,3,3,0,3,26,3.89,3,2,-3.4,2.1,1.87,4.6,9,-3,1.21,0.66,2.48,-1.47,6,0.872,0.236,1.65,0.28,-0.06,0.75,0.28,0.3,0.734,78,5.4,4,7.9,0.15,-6.6,0.21,21,14,0.14,24,2,0.04,-0.59,-0.00416,-0.03842,1.24,0.5,0.56,9,0.84,1.11,1.42,3.2,3.4,4.514,0.75,10,6,1,3,22,7,22,9,10,5,0.3,6,2.7,5,9,14,1.1,0.6,2,31,0.0131,3,6,4,0.107,-0.5,1.7,3,2,1,1,5.3,-0.01,6.3,1.99,21.9,0.145,5,-1,-0.03348,-2.11,0.4,-3.6,20,0.4,7,0.1,0.47,0.163,0.139,-0.4,-2,0.007273,0.2,7.1,3.49,4,3,3.11,0.05722,9,0.55155,1.08,0.49,1803,6.5,8.1,0.0839,-0.2,3.9,2.9,4.3,1,11,-1.248,> 10 Å,,43.05933498090001,1.0,0.0,0.0,2.0,2.0,2.0,2.0,2.0,2.0,2.0,2.0,2.0,2.0,2.0,1.0,1.0,-1.0,0.0,0.0,-3.0,0.0,-2.0,-1.0,-,-,-,-,-,0.530990058835464,0.0,0.0,0.0,0.0,0.0,0.0,0.0,24.0,0.0,0.0,0.0,0.0,0.0,0.0,0.0,0.0,0.0,0.0,0.0,0.0,0.0,0.0,0.0,0.0,0.0,0.0,0.0,0.0,0.0,0.0,0.0,0.0,0.0,0.0,0.0,0.0,0.0,0.0,0.0,0.0,0.0,0.0,0.0,0.0,0.0,0.0,0.0,0.0,0.0,0.0,0.0,0.0,0.0,0.0,0.0,0.0,0.0,0.0,0.0,0.0,0.0,0.0,0.0,0.0,0.0,0.0,0.0,0.0,0.0,0.0,0.0,0.0,0.0,0.0,0.0,0.0,0.0,0.0,0.0,0.0,0.0,24.0,0.049,0.0174576405555347,0.0176903406361852,-,0.0,0.0,0.0,88.0,0.0,0.0,0.0,3.0,10.0,0.0,1.0,0.0,5.0,0.0,0.0,0.0,80.0,0.0,0.0,0.0,1.0,6.0,0.0,0.0,0.0,6.0,7.39528176010309,7.64861199906766,-,,,,,,,,-,-,-,-
1,N39Y,A,-,0.32484076433121,-163.8,105.6,2.16472566606973,0.0,-6.0,0.0,0.0,1.0,1.0,-6.0,0.0,1.0,-3,-4,2,-2,143,-0.93,-2,0,0.4,-0.1,-6.7,-0.4,-1,9.5,-0.28,-0.11,0.53,-2.82,2,0.338,0.387,0.4,-1.47,-2.47,-0.2,0.02,-0.2,-0.491,66,1,-1,3.8,0.04,-7,0.05,-3,-4,0.04,-13,-2,0.12,-2.76,0.00175,-0.02262,0.22,0.01,0.43,0,1.08,0.83,-0.36,-1.3,-0.8,-0.577,-0.2,6,1,-4,-2,13,-2,-4,-2,0,-10,-0.74,-4,-1.4,2,-7,4,-0.2,-0.2,-1,-19,-0.07248,0,0,-3,0.017,0,-0.5,0,-2,-1,-0.3,6.1,0.26,5.9,0.24,20.1,0.009,3,2,-0.01661,-3.14,-0.3,-5,50,3.42,1,-0.8,-0.27,0.048,0.017,-0.8,-3.5,-0.006968,-0.6,0.1,-3.14,-2,-1,-0.19,0.058,-2,0.12638,1.27,0.02,3792,5.7,1,-0.1149,2.5,-1.2,-1.4,-0.9,1,8,-0.28300000000000003,> 10 Å,,47.0361595584,-3.0,-4.0,-2.0,-2.0,-2.0,-2.0,-2.0,-2.0,-2.0,-2.0,-2.0,-3.0,-3.0,-3.0,-3.0,-3.0,-2.0,-2.0,-2.0,-4.0,-2.0,-3.0,-2.0,-,-,-,-,-,0.522366522366522,0.0,1.0,0.0,0.0,0.0,0.0,0.0,0.0,0.0,0.0,0.0,0.0,0.0,0.0,0.0,0.0,0.0,0.0,0.0,0.0,0.0,0.0,0.0,0.0,0.0,0.0,0.0,0.0,0.0,0.0,0.0,0.0,0.0,0.0,0.0,0.0,0.0,0.0,0.0,0.0,0.0,0.0,0.0,0.0,0.0,0.0,0.0,0.0,0.0,0.0,0.0,0.0,0.0,0.0,0.0,0.0,0.0,0.0,0.0,0.0,0.0,0.0,0.0,0.0,0.0,0.0,0.0,0.0,0.0,0.0,0.0,0.0,0.0,0.0,0.0,0.0,0.0,0.0,0.0,0.0,0.0,1.0,-0.8640000000000001,0.0311855720321165,0.0291901373136176,-,0.0,4.0,1.0,47.0,3.0,1.0,0.0,0.0,0.0,0.0,4.0,1.0,2.0,0.0,4.0,3.0,47.0,3.0,0.0,0.0,0.0,0.0,0.0,3.0,1.0,2.0,7.5775107441682,7.73417686176123,-,,,,,,,,-,-,-,-
15,V42L,A,S,0.19718309859154887,-142.3,-33.9,2.99153022113298,0.0,-1.0,0.0,0.0,0.0,0.0,0.0,0.0,0.0,1,1,0,1,32,2.28,1,1,-0.1,2,5.63,8.4,0,29.2,-2.57,-0.74,-1.5,-4.85,6,0.973,0.598,-0.93,-3.5,-5.38,-0.3,-0.19,-0.1,-0.454,99,3.8,2,7,-0.48,-5.8,0.25,5,6,0.23,26,1,0.41,-6.48,-0.01432,-0.00721,-0.77,-0.8,-1.03,0,1.35,0.88,0.81,1.8,3.4,-1.214,-0.29,10,3.9,-2,2,9,14,-6,8,8,-1,-1.03,13,1.8,5,-4,8,-1.2,-0.9,1,18,-0.1274,4,3,6,0.112,2.5,-0.6,1,1,1,-0.4,6.1,0.21,6,-1.59,18.9,0.134,5,1,-0.06701,-6.03,-0.9,-6.2,306,0.91,6,-1.2,0.49,0.111,0.145,-1,-4.7,-0.00194,-0.4,3.8,3.43,2,2,-2.38,-0.27941,5,-0.10641,0.49,-0.33,32623,5.6,3.6,-0.4593,1.1,2,1.9,1.9,1,10,-0.794,> 10 Å,,47.12341435,0.0,1.0,2.0,2.0,1.0,1.0,1.0,1.0,1.0,1.0,1.0,1.0,1.0,0.0,0.0,0.0,1.0,2.0,2.0,-2.0,2.0,-1.0,0.0,-,-,-,-,-,0.531542056074766,3.0,0.0,0.0,0.0,0.0,0.0,0.0,2.0,0.0,0.0,0.0,0.0,0.0,0.0,0.0,0.0,0.0,0.0,0.0,0.0,0.0,0.0,0.0,0.0,0.0,0.0,0.0,0.0,0.0,0.0,0.0,0.0,0.0,0.0,0.0,0.0,0.0,0.0,0.0,0.0,0.0,0.0,0.0,0.0,0.0,0.0,0.0,0.0,0.0,0.0,0.0,0.0,0.0,0.0,0.0,0.0,0.0,0.0,0.0,0.0,0.0,0.0,0.0,0.0,0.0,0.0,0.0,0.0,0.0,0.0,0.0,0.0,0.0,0.0,0.0,0.0,0.0,0.0,0.0,0.0,0.0,5.0,0.021,0.0294253829120135,0.0292454184742192,-,0.0,1.0,1.0,74.0,2.0,1.0,0.0,0.0,1.0,0.0,2.0,1.0,4.0,0.0,1.0,2.0,75.0,2.0,0.0,0.0,0.0,2.0,0.0,2.0,2.0,4.0,3.10478863109364,3.1879793602240403,-,,,,,,,,-,-,-,-
91,A43V,A,S,0.235849056604,-48.0,-69.3,2.32622434653,0.0,-2.0,0.0,0.0,0.0,0.0,0.0,0.0,0.0,-5,-6,0,-2,160,-3.85,-3,-3,-0.1,-0.4,-7.82,-1.4,-2,8,-0.22,-0.07,0.12,-2.84,1,0.225,0.32,0.38,-1.5,-2.25,-0.01,-0.03,-0.2,0.694,38,1,-2,2.4,-0.04,-7.2,-0.22,-4,-5,-0.19,-22,-3,0.09,-2.76,0.00156,-0.00868,-0.27,-0.07,0.04,0,1.12,0.73,-1.21,-3.8,-2.9,8.069,0,3,0.3,-10,-4,7,-7,-8,-13,0,-14,0.11,-10,-2.8,1,-12,-5,-0.2,-0.1,-3,-20,0.00165,-1,-2,0,0.011,-5.5,-0.3,0,-5,-1,-0.2,6.2,0.25,6.2,0.02,14.9,0.006,2,-4,-0.05851,-3.63,-0.2,-4.7,52,3.95,-6,-1,-0.34,0.011,0.012,-0.7,-3.5,0.000182,-0.5,0.9,-3.58,-5,-3,0.18,-0.12981,-3,0.46473,1.46,-0.06,5105,5.7,0.5,-0.1165,2.3,-3,-2.8,-2.3,1,7,-0.21,> 10 Å,,43.574195001199996,-1.0,1.0,0.0,0.0,0.0,0.0,0.0,0.0,0.0,0.0,0.0,0.0,0.0,-1.0,-1.0,-1.0,0.0,0.0,0.0,-2.0,0.0,-1.0,0.0,-,-,-,-,-,0.5579785392869511,57.0,1.0,0.0,0.0,0.0,0.0,0.0,0.0,0.0,0.0,0.0,0.0,0.0,0.0,0.0,0.0,0.0,0.0,0.0,0.0,0.0,1.0,0.0,0.0,0.0,0.0,0.0,0.0,0.0,0.0,0.0,0.0,0.0,0.0,0.0,0.0,0.0,0.0,1.0,0.0,0.0,0.0,0.0,0.0,0.0,0.0,0.0,0.0,0.0,0.0,0.0,0.0,0.0,0.0,0.0,0.0,0.0,0.0,0.0,0.0,0.0,0.0,0.0,0.0,0.0,0.0,0.0,0.0,0.0,0.0,0.0,0.0,0.0,20.0,0.0,0.0,0.0,0.0,0.0,0.0,0.0,80.0,-0.29600000000000004,0.0197507645314769,0.0196144012074463,-,0.0,0.0,1.0,60.0,0.0,1.0,0.0,0.0,6.0,0.0,0.0,1.0,4.0,0.0,0.0,1.0,60.0,0.0,1.0,0.0,0.0,5.0,0.0,0.0,1.0,4.0,3.05962967901468,3.08996815119689,-,,,,,,,,-,-,-,-
19,G44V,A,S,0.0,-117.1,-148.0,4.00449895476,0.0,-3.0,0.0,0.0,0.0,0.0,0.0,0.0,0.0,-2,-3,-1,-1,94,-3.91,-1,-2,-1,-0.4,0.39,-0.4,3,-7.1,-0.67,0.11,1.13,-2.34,0,0,0.25,0.75,-1.64,-1.62,-0.23,-0.06,,-0.336,36,2,1,5.3,0.11,-6.3,0.08,7,8,0.08,8,-1,0.15,-1.59,-0.00242,-0.021,0.37,0.17,-0.55,0,0.61,1.02,-1.2,-2.1,0.9,,-0.22,6,1.2,-3,1,-4,-5,0,3,6,2,-0.06,-7,0.1,3,4,1,0.8,0.8,-1,-10,-0.06461,2,1,3,0.042,-4.5,-0.4,0,0,0,0.5,6.1,-0.24,4.7,0.56,18.7,0.008,4,-2,-0.01798,-1.84,0.7,-3.7,83,2.37,2,,0.11,0.041,0.011,0.2,,0.001528,0.5,0.2,0.59,-1,0,0.29,-0.13454,4,-0.22435,1.88,-0.11,8632,4.5,1.9,0.1115,1.1,0.7,0.2,0.8,1,9,0.6729999999999999,> 10 Å,,41.1377005799,-5.0,-3.0,-3.0,-4.0,-3.0,-4.0,-4.0,-3.0,-3.0,-3.0,-4.0,-4.0,-4.0,-4.0,-5.0,-5.0,-2.0,-2.0,-1.0,-5.0,-1.0,-4.0,-3.0,-,-,-,-,-,0.566978193146418,7.0,1.0,0.0,0.0,0.0,0.0,0.0,3.0,0.0,0.0,0.0,0.0,1.0,0.0,0.0,0.0,0.0,0.0,0.0,0.0,0.0,0.0,0.0,0.0,0.0,0.0,0.0,0.0,0.0,0.0,0.0,0.0,0.0,0.0,0.0,0.0,0.0,0.0,0.0,0.0,0.0,0.0,0.0,0.0,0.0,0.0,0.0,0.0,0.0,0.0,1.0,0.0,0.0,0.0,0.0,0.0,0.0,0.0,0.0,0.0,0.0,0.0,0.0,0.0,0.0,0.0,0.0,0.0,0.0,0.0,0.0,0.0,0.0,0.0,0.0,0.0,0.0,0.0,0.0,0.0,0.0,13.0,-0.273,0.0157422809759403,0.0147674143626734,-,0.0,1.0,1.0,52.0,2.0,1.0,0.0,0.0,0.0,0.0,2.0,0.0,3.0,0.0,0.0,1.0,51.0,2.0,0.0,0.0,0.0,0.0,0.0,2.0,0.0,3.0,2.98536556730216,3.0930766307924302,-,,,,,,,,-,-,-,-
1,F45N,A,S,0.0,-60.2,138.1,6.923757405781619,0.0,6.0,0.0,0.0,-1.0,-2.0,6.0,0.0,-1.0,-4,-6,2,-2,158,-6.22,-4,-1,0.4,0.4,-8.26,-4.4,-4,-9.3,-0.43,-0.01,0.42,-3.17,1,-0.072,0.278,0.46,-1.41,-3.55,0.18,0.22,0.1,0.336,47,0.1,-3,2.1,-0.22,-8.2,-0.12,-9,-9,-0.13,-23,-4,-0.71,-3.75,0.00842,0.00709,0.5,0.29,0.36,0,1.11,0.83,-2.25,-3.8,-2.5,-0.638,0.18,6,0.2,-8,-4,-6,-14,-15,-8,-19,-18,-0.02,-11,-3.1,0,-22,-9,0.1,0,-3,-29,0.00294,1,-1,1,0.004,-2,0.2,0,-4,-1,-0.4,6.1,-0.1,6.1,0.63,11.4,0.006,1,-1,0.09736,-3.89,-0.2,-5,27,3.7,-3,-0.6,-0.33,0.013,0.006,-0.6,-3.2,0.003461,-0.4,0.1,-4.59,-5,-3,-0.7,0.27039,-6,0.26608,1.19,0.38,2940,5.8,0.4,0.0018,-1.3,-3.5,-3.2,-3.5,2,6,-2.8939999999999997,> 10 Å,,35.273188061199996,-5.0,-1.0,-1.0,-3.0,-2.0,-4.0,-4.0,-3.0,-3.0,-3.0,-3.0,-4.0,-4.0,-4.0,-4.0,-4.0,-4.0,-5.0,-3.0,-9.0,-4.0,-6.0,-5.0,-,-,-,-,-,0.566978193146418,1.0,0.0,0.0,0.0,0.0,0.0,0.0,0.0,0.0,0.0,0.0,0.0,0.0,0.0,0.0,0.0,0.0,0.0,0.0,0.0,0.0,0.0,0.0,0.0,0.0,0.0,0.0,0.0,0.0,0.0,0.0,0.0,0.0,0.0,0.0,0.0,0.0,0.0,0.0,0.0,0.0,0.0,0.0,0.0,0.0,0.0,0.0,0.0,0.0,0.0,0.0,0.0,0.0,0.0,0.0,0.0,0.0,0.0,0.0,0.0,0.0,0.0,0.0,0.0,0.0,0.0,0.0,0.0,0.0,0.0,0.0,0.0,0.0,0.0,0.0,0.0,0.0,0.0,0.0,0.0,0.0,1.0,-0.132,0.012896161912403998,0.0129002847699179,-,0.0,0.0,0.0,115.0,1.0,3.0,0.0,1.0,16.0,0.0,1.0,0.0,7.0,0.0,1.0,1.0,106.0,1.0,3.0,0.0,3.0,14.0,1.0,1.0,1.0,6.0,3.6246622055045896,3.5858569994623704,-,,,,,,,,-,-,-,-
19,A46S,A,-,0.0,134.1,146.9,5.01298679511,0.0,1.0,0.0,0.0,0.0,-1.0,0.0,0.0,-1.0,2,2,-1,1,99,1.27,1,0,0.4,2,-3.67,3.5,2,7.3,-0.83,0.1,0.46,-2.76,2,0.281,0.193,0.45,-1.74,-1.89,-0.06,0.01,0.1,0.115,94,7.4,1,6.3,0.08,-5.6,-0.4,1,0,-0.38,10,0,0.16,-2.01,0.00167,0.00275,0.24,0.15,0.18,0,0.8,1.17,0.34,0,1.7,0.022,-0.06,9,9.5,0,1,12,4,9,5,9,1,-0.01,4,1.1,4,3,7,0.9,0.9,0,12,0.00648,0,2,0,0.104,2,-0.1,1,1,1,0.3,4.9,-0.15,4.7,-0.06,20.4,0.1,5,2,0.05356,-2.49,0.8,-2.9,64,0.51,0,0.5,0.14,0.086,0.078,-0.2,-2.4,-0.001515,0.3,18.1,-0.12,1,1,-0.41,0.0035,0,0.10475,1.04,-0.01,11447,4.7,5.1,0.0464,0.1,1.3,1.1,1.4,1,10,-1.2429999999999999,> 10 Å,,41.6379432489,1.0,1.0,1.0,1.0,1.0,1.0,1.0,1.0,1.0,1.0,1.0,1.0,1.0,1.0,1.0,1.0,1.0,1.0,1.0,0.0,1.0,1.0,1.0,-,-,-,-,-,0.576272917624228,2.0,0.0,0.0,0.0,0.0,0.0,0.0,5.0,0.0,0.0,0.0,0.0,0.0,0.0,0.0,0.0,0.0,0.0,0.0,0.0,0.0,0.0,0.0,0.0,0.0,0.0,0.0,0.0,0.0,0.0,0.0,0.0,0.0,0.0,0.0,0.0,0.0,0.0,0.0,0.0,0.0,0.0,0.0,0.0,0.0,0.0,0.0,0.0,0.0,0.0,0.0,0.0,0.0,0.0,0.0,0.0,0.0,0.0,0.0,0.0,0.0,0.0,0.0,0.0,0.0,0.0,0.0,0.0,0.0,0.0,0.0,0.0,0.0,0.0,0.0,0.0,0.0,0.0,0.0,0.0,0.0,7.0,0.696,0.0175151208549439,0.0177049770701253,-,0.0,2.0,1.0,74.0,2.0,2.0,0.0,0.0,3.0,0.0,2.0,3.0,3.0,0.0,3.0,1.0,73.0,2.0,2.0,0.0,0.0,2.0,0.0,2.0,3.0,3.0,4.45303799792906,4.37242324694364,-,,,,,,,,-,-,-,-
3,K47R,A,S,0.326829268293,-114.7,3.2,2.16388220289,0.0,0.0,-1.0,0.0,0.0,-2.0,0.0,0.0,0.0,-4,-5,2,-3,194,-0.44,-3,0,-0.1,-1.1,0.33,2.4,3,37.4,-2.05,-0.39,-0.87,-4.08,4,0.817,0.195,-0.58,-2.92,-3.89,0.04,0.16,0.1,0.069,92,0.6,2,4.7,0.1,-10.6,0.29,-1,0,0.25,5,-2,0.4,-4.16,-0.0026,0.03435,-0.23,-0.16,-0.65,5,1.22,1,0.13,-7.7,-0.3,-0.811,0.04,8,0.6,-3,0,-9,0,-8,-25,-7,-7,-0.96,3,-0.5,1,-8,-19,-0.1,-0.3,-6,-18,0.02167,1,4,0,0,0.5,-0.1,0,-1,-1,-1.2,5.9,0.25,6.1,-1.26,17.3,0.001,3,-1,-0.01389,-4.71,-1,-6.6,43,2.38,-1,-0.8,0.21,0,0,-1.1,-3.8,0.002585,-1,0.6,-1.25,-1,0,-1.31,0.00201,0,0.16464,0.48,0.27,2045,6.1,0.7,-0.2444,2.6,0.6,-0.4,2.6,1,10,0.035,> 10 Å,,37.7330617496,2.0,1.0,2.0,3.0,3.0,3.0,3.0,2.0,2.0,2.0,2.0,2.0,2.0,2.0,2.0,2.0,2.0,4.0,3.0,0.0,4.0,2.0,2.0,-,-,-,-,-,0.585877466251298,0.0,0.0,0.0,0.0,0.0,0.0,0.0,1.0,0.0,2.0,0.0,0.0,0.0,0.0,0.0,0.0,0.0,0.0,0.0,0.0,0.0,0.0,0.0,0.0,0.0,0.0,0.0,0.0,0.0,0.0,0.0,0.0,0.0,0.0,0.0,0.0,0.0,0.0,0.0,0.0,0.0,0.0,0.0,0.0,0.0,0.0,0.0,0.0,0.0,0.0,0.0,0.0,0.0,0.0,0.0,0.0,0.0,0.0,0.0,0.0,0.0,0.0,0.0,0.0,0.0,0.0,0.0,0.0,0.0,0.0,0.0,0.0,0.0,0.0,0.0,0.0,0.0,0.0,0.0,0.0,0.0,3.0,0.82,0.0248865811974304,0.0249628821019228,-,0.0,1.0,0.0,76.0,0.0,2.0,0.0,0.0,6.0,0.0,0.0,1.0,5.0,0.0,0.0,0.0,60.0,0.0,1.0,0.0,0.0,4.0,0.0,0.0,1.0,4.0,4.04936728629813,4.0672050974961005,-,,,,,,,,-,-,-,-
1,F48I,A,-,0.43147208121799996,84.9,110.6,2.18189488219,0.0,3.0,0.0,0.0,0.0,0.0,6.0,0.0,0.0,1,1,-2,1,56,3.08,1,-1,-1.7,1.4,0.49,2.3,1,-9.1,0.09,-0.06,1.12,-2.2,1,-0.051,0.247,0.93,-1.06,-1.6,-0.97,-0.57,-0.8,-0.782,96,4.2,1,6.4,-1.11,-6.7,0.58,17,13,0.5,24,1,0.25,-1.8,-0.01791,-0.09281,-0.36,-0.87,-0.34,9,0.78,1.22,1.11,1.1,1.2,5.139,-0.97,9,4.8,-4,0,10,5,14,2,13,-4,-0.09,3,1.2,4,3,10,0,-0.4,1,14,-0.1536,3,4,2,0.065,-7.5,-0.7,0,-1,0,1.4,6.3,0.16,5.8,0.67,19.2,0.053,4,-4,-0.32208,-2.83,-0.4,-3.8,70,1.14,6,-1.1,0.54,0.059,0.071,-1,-3.2,-0.009604,0.2,5.8,2.26,1,1,1.31,-0.84899,9,-0.92364,0.93,-1.04,10234,5.3,4,-0.2403,2,1,1.2,0.9,1,11,-1.042,> 10 Å,,44.4853386522,-1.0,0.0,1.0,1.0,0.0,0.0,0.0,0.0,0.0,0.0,0.0,0.0,-1.0,-1.0,-1.0,-1.0,0.0,1.0,1.0,-2.0,1.0,-1.0,0.0,-,-,-,-,-,0.566978193146418,0.0,0.0,0.0,0.0,0.0,0.0,0.0,0.0,0.0,0.0,0.0,0.0,0.0,0.0,0.0,0.0,0.0,0.0,1.0,0.0,0.0,0.0,0.0,0.0,0.0,0.0,0.0,0.0,0.0,0.0,0.0,0.0,0.0,0.0,0.0,0.0,0.0,0.0,0.0,0.0,0.0,0.0,0.0,0.0,0.0,0.0,0.0,0.0,0.0,0.0,0.0,0.0,0.0,0.0,0.0,0.0,0.0,0.0,0.0,0.0,0.0,0.0,0.0,0.0,0.0,0.0,0.0,0.0,0.0,0.0,0.0,0.0,0.0,0.0,0.0,0.0,0.0,0.0,0.0,0.0,0.0,1.0,0.763,0.0330604162090177,0.0329226708283917,-,0.0,1.0,2.0,117.0,3.0,2.0,0.0,1.0,16.0,0.0,3.0,4.0,5.0,0.0,3.0,2.0,96.0,2.0,1.0,0.0,0.0,10.0,0.0,3.0,2.0,4.0,5.36605753575336,5.13802695935122,-,,,,,,,,-,-,-,-
1,L49I,A,G,0.128048780488,43.9,-104.6,2.82715451736,0.0,0.0,0.0,0.0,0.0,0.0,0.0,0.0,0.0,-4,-4,-2,-3,121,-4.23,-3,-4,-0.1,1.6,-10.31,0.2,-2,10.8,-0.23,0.26,0.86,-2.84,0,-0.186,0.444,0.74,-1.07,-2.56,0.33,0.28,0.4,0.255,33,2.5,-2,3.3,0.3,-7.3,-0.09,-12,-11,-0.09,-20,-4,-0.42,-2.67,0.0125,0.04775,0.47,0.41,0.34,0,1.08,1.04,-1.84,-4.2,-1.3,1.944,0.34,4,0.9,-6,-2,-24,-3,-3,-8,-4,-6,-0.02,-2,-1.9,2,-8,-12,0.5,0.5,-2,-28,0.0595,-2,-2,-3,0.021,-6.5,0.4,0,-3,-1,0.8,5.5,-0.13,5.4,0.48,15.1,0.006,4,-5,0.11895,-3.2,0.4,-4.2,39,2.97,-6,0,-0.44,0.017,0.018,0.2,-2.8,0.001387,0.9,0.6,-4.26,-3,-2,0.39,0.41691,-9,0.22764,0.71,0.46,5241,5.3,1.2,0.101,1.3,-2.7,-2.1,-3,1,4,-0.353,> 10 Å,,45.9696211862,1.0,2.0,2.0,2.0,2.0,2.0,2.0,2.0,2.0,2.0,2.0,1.0,1.0,1.0,1.0,1.0,1.0,2.0,2.0,-1.0,3.0,0.0,1.0,-,-,-,-,-,0.566978193146418,0.0,0.0,0.0,0.0,0.0,0.0,0.0,0.0,0.0,0.0,0.0,0.0,0.0,0.0,0.0,0.0,0.0,0.0,0.0,0.0,0.0,0.0,0.0,0.0,0.0,0.0,0.0,0.0,0.0,0.0,0.0,0.0,0.0,0.0,0.0,0.0,0.0,1.0,0.0,0.0,0.0,0.0,0.0,0.0,0.0,0.0,0.0,0.0,0.0,0.0,0.0,0.0,0.0,0.0,0.0,0.0,0.0,0.0,0.0,0.0,0.0,0.0,0.0,0.0,0.0,0.0,0.0,0.0,0.0,0.0,0.0,0.0,0.0,0.0,0.0,0.0,0.0,0.0,0.0,0.0,0.0,1.0,0.884,0.0565686947015839,0.0568629749494296,-,0.0,0.0,1.0,51.0,0.0,2.0,0.0,0.0,7.0,0.0,0.0,1.0,3.0,0.0,0.0,1.0,55.0,0.0,2.0,0.0,0.0,8.0,0.0,0.0,1.0,3.0,5.81883464217041,5.972181418607299,-,,,,,,,,-,-,-,-
17,T76I,A,S,0.661971830985916,-89.9,-94.3,1.9977062696639198,0.0,-3.0,0.0,0.0,0.0,1.0,0.0,0.0,1.0,-1,-2,1,-1,89,-3.03,-1,0,-0.8,1.6,-7.48,3.2,0,13.6,-1.52,-0.15,-0.2,-3.87,1,0.382,0.385,-0.28,-2,-3.74,0.13,0.08,0.1,0.167,88,3.1,1,4.6,0.14,-7.1,0.32,-4,-2,0.3,-5,-2,-0.59,-4.03,0.00232,-0.02153,-0.18,0,-0.29,0,1.27,-,-0.96,-3.2,0,-0.808,0.14,8,1.7,-2,0,-7,-1,2,-3,-1,3,-0.29,0,-0.6,3,1,-7,-0.3,-0.2,-2,-8,0.0158,0,0,0,0.039,0.5,0,1,0,0,0.3,6.1,-0.05,5.8,-0.3,17.5,0.015,3,-1,0.00418,-3.61,-0.2,-5.9,67,2.14,-3,-0.6,0,0.026,0.027,-0.3,-3.8,-0.004179,0.4,0.9,-1.36,-1,0,-1.14,0.11428,-3,0.2867,0.79,0.13,7958,5.6,2,-0.07,0.8,0.3,-0.3,0.7,1,10,-0.146,> 10 Å,,55.1448690814,-2.0,0.0,-1.0,-1.0,-1.0,-1.0,-1.0,-1.0,-1.0,-1.0,-1.0,-1.0,-1.0,-1.0,-1.0,-2.0,0.0,0.0,0.0,-2.0,0.0,-1.0,0.0,-,-,-,-,-,0.66800764356834,2.0,0.0,0.0,0.0,0.0,0.0,0.0,2.0,0.0,0.0,2.0,0.0,0.0,0.0,0.0,0.0,0.0,0.0,0.0,0.0,0.0,0.0,0.0,0.0,0.0,0.0,0.0,0.0,0.0,0.0,0.0,0.0,0.0,0.0,0.0,0.0,0.0,0.0,0.0,0.0,0.0,0.0,0.0,0.0,0.0,0.0,0.0,0.0,0.0,0.0,0.0,0.0,0.0,0.0,0.0,0.0,0.0,0.0,0.0,0.0,0.0,0.0,0.0,0.0,0.0,0.0,0.0,0.0,0.0,0.0,0.0,0.0,0.0,0.0,0.0,0.0,0.0,0.0,0.0,0.0,0.0,6.0,0.5,0.433546244354904,0.4320637614001821,-,0.0,1.0,2.0,41.0,2.0,1.0,0.0,0.0,1.0,0.0,3.0,0.0,1.0,0.0,1.0,0.0,35.0,2.0,0.0,0.0,0.0,0.0,0.0,3.0,1.0,1.0,12.280280245000801,12.609040746558303,-,,,,,,,,-,-,-,-
1,T76N,A,S,0.661971830985916,-89.9,-94.3,1.9977062696639198,0.0,0.0,0.0,0.0,-1.0,-1.0,0.0,0.0,0.0,0,0,1,0,65,1.14,0,1,1.5,1.1,-0.75,-0.1,1,-5.2,-0.23,0.04,0.75,-2.43,3,0.519,0.076,0.54,-0.9,-1.51,-0.11,-0.11,-0.3,-0.018,63,0.8,1,5.7,-0.3,-6.4,0.01,4,2,0.01,12,-1,0.11,-1.88,-0.00245,0.00571,1.23,0,0.13,0,0.99,0.93,0.3,0.1,1.4,0.053,-0.11,9,2.7,-1,0,8,3,3,-4,6,3,-0.27,2,0.5,3,4,2,0.3,0.2,0,0,0.00302,3,4,1,0.036,-1.5,-0.3,1,0,0,0.5,5.2,-0.23,5.5,0.7,20.2,0.024,4,-1,-0.02649,-2.05,0.1,-3.5,46,1.4,2,-0.4,0.13,0.057,0.11,-0.4,-3.4,-0.005914,0.4,2.6,-0.21,0,0,0.35,-0.15047,2,-0.28531,1.23,-0.22,5790,5.3,2.2,0.0155,0.9,0.5,0.4,0.5,1,10,-0.128,> 10 Å,,55.1448690814,-1.0,1.0,0.0,0.0,0.0,0.0,0.0,0.0,0.0,0.0,0.0,0.0,0.0,0.0,0.0,-1.0,0.0,0.0,0.0,-2.0,0.0,-1.0,0.0,-,-,-,-,-,0.66800764356834,1.0,0.0,0.0,0.0,0.0,0.0,0.0,0.0,0.0,0.0,0.0,0.0,0.0,0.0,0.0,0.0,0.0,0.0,0.0,0.0,0.0,0.0,0.0,0.0,0.0,0.0,0.0,0.0,0.0,0.0,0.0,0.0,0.0,0.0,0.0,0.0,0.0,0.0,0.0,0.0,0.0,0.0,0.0,0.0,0.0,0.0,0.0,0.0,0.0,0.0,0.0,0.0,0.0,0.0,0.0,0.0,0.0,0.0,0.0,0.0,0.0,0.0,0.0,0.0,0.0,0.0,0.0,0.0,0.0,0.0,0.0,0.0,0.0,0.0,0.0,0.0,0.0,0.0,0.0,0.0,0.0,1.0,0.5,0.437791549801218,0.4320637614001821,-,0.0,1.0,2.0,41.0,2.0,1.0,0.0,0.0,1.0,0.0,3.0,0.0,1.0,0.0,1.0,0.0,35.0,2.0,0.0,0.0,0.0,0.0,0.0,3.0,1.0,1.0,12.280280245000801,12.6022704896754,-,,,,,,,,-,-,-,-
1,S78P,A,H,0.2,-57.5,-42.3,2.45673469715464,0.0,-3.0,0.0,0.0,0.0,1.0,0.0,0.0,1.0,-1,-2,1,-1,74,-1.28,-1,0,-1.8,-0.3,-1.44,-0.6,-1,-7.1,0.32,0.2,0.76,-2.57,1,0.2,-0.363,0.94,-0.48,-1.35,0.01,-0.02,-0.3,0.057,95,1.2,1,5.6,-0.15,-6.8,0.35,6,5,0.35,15,-1,0.24,-1.57,-0.00189,0.00469,0.48,0.17,0.6,0,0.87,0.79,-0.29,-1,2,-1.047,0.01,7,3.6,-1,1,-4,-3,9,-4,-9,1,0.44,-3,0.4,3,6,-4,0.6,0.6,-1,-8,0.112,5,2,5,0.027,-4,0.4,0,1,0,0.5,5.1,-0.13,5.2,0.67,17.9,0.02,4,-3,-0.02111,-1.56,0.4,-3.4,38,0.56,1,0.2,0.27,0.082,0.04,0.3,-2.2,-0.003125,0.5,2.8,0.06,0,0,0.75,-0.11199,3,-0.10791,1.87,-0.05,4843,5.4,1.8,0.1626,0.4,1.1,0.5,1.4,1,10,-0.336,> 10 Å,,53.1163321588,-2.0,-1.0,-2.0,-1.0,-1.0,-1.0,-1.0,-1.0,-1.0,-1.0,-1.0,-1.0,-1.0,-1.0,-2.0,-2.0,1.0,1.0,1.0,-2.0,1.0,0.0,0.0,-,-,-,-,-,0.679141104294479,1.0,0.0,0.0,0.0,0.0,0.0,0.0,0.0,0.0,0.0,0.0,0.0,0.0,0.0,0.0,0.0,0.0,0.0,0.0,0.0,0.0,0.0,0.0,0.0,0.0,0.0,0.0,0.0,0.0,0.0,0.0,0.0,0.0,0.0,0.0,0.0,0.0,0.0,0.0,0.0,0.0,0.0,0.0,0.0,0.0,0.0,0.0,0.0,0.0,0.0,0.0,0.0,0.0,0.0,0.0,0.0,0.0,0.0,0.0,0.0,0.0,0.0,0.0,0.0,0.0,0.0,0.0,0.0,0.0,0.0,0.0,0.0,0.0,0.0,0.0,0.0,0.0,0.0,0.0,0.0,0.0,1.0,1.496,0.3714619245971539,0.3740947157085879,-,0.0,1.0,1.0,39.0,1.0,0.0,0.0,0.0,0.0,0.0,2.0,1.0,2.0,0.0,0.0,4.0,39.0,1.0,0.0,0.0,0.0,0.0,0.0,2.0,1.0,1.0,6.02802495943305,5.95009155359388,-,,,,,,,,-,-,-,-